رفتن به مطلب
انجمن اندروید ایران | آموزش برنامه نویسی اندروید و موبایل

5 فایل

  1. رایگان

    سورس کد موزیک پلیر مانند موزیک پلیر apple

    سلام
     
    سورس کد اندروید  موزیک پلیر مانند Spotify و Apple music
     
    همراه با سورس سمت سرور
     
    موفق باشید

    109 دریافت

       (0 امتیاز)

    0 دیدگاه

    ارسال

  2. رایگان

    سورس کد فروشگاه اندروید همراه با سورس سایت

    سورس اندروید استودیو  فروشگاه اینترنتی +  وب سایت +  وبسرویس
     
    زبان ها  جاوا + php

    1,285 دریافت

       (5 امتیاز)

    0 دیدگاه

    بروزرسانی

  3. رایگان

    سورس پروژه اندروید Memory

    سورس پروژه اندروید Memory که بطور رایگان برای کاربران شاپ دروید قرار گرفته است.این پروژه بدین صورت عمل میکند که لیستی از تصاویر نمایش داده میشود و کاربر میبایستی ابتدا آنها را بخاطر بسپارد و بعد بازی شروع میشود.
    بعد اینکه بازی شروع شد باید چیکار کنیم؟
    تصاویر در زیر دکمه ها مخفی میشوند و کاربر باید تصاویر را تشخیص داده تا بتوانند بازی را به اتمام برساند.

    93 دریافت

       (0 امتیاز)

    0 دیدگاه

    ارسال

  4. رایگان

    سورس پروژه اندروید Music Player

    ایا به سورس اپلیکیشن اندرویدی نیاز دارید که بتوانید یک Music Player قوی پخش فایل های صوتی را داشته باشید،با این پروژه اندرویدی میتوانید اینکار را انجام دهید.
     
    ویژگی های این پروژه اندرویدی :
    پخش فایل صوتی از طریق حافظه داخلی استریم فایل ها صوتی از طریق اینترنت پخش فایل های صوتی با فرمت های  MP3, AMR, AAC, PCM WAV, OGG, MP4a, 3GP

    189 دریافت

       (0 امتیاز)

    4 دیدگاه

    ارسال

  5. رایگان

    سورس اپلیکیشن اندروید ChatApp

    سورس اپلیکیشن whatsApp یک اپلیکیشن چت و سورس باز که بصورت رایگان در اختیار کاربران انجمن اندروید ایران  قرار گرفته است.
     
    دانلود سورس اپلیکیشن واتزاپ Whatschat- Whatsapp clone نسخه 1.0
    Real time chat functionality
    Whatsapp feel
    Add Friends
    User Profile and Status
    User online and offline system
    Create Group and add friends to group
    Chat in group
    Chat with friends
    Login and Registration System

    238 دریافت

       (0 امتیاز)

    0 دیدگاه

    ارسال

  • برترین ارسال‌ کنندگان

    هفته

    در این هفته هیچ ارسال کننده برتری وجود ندارد.

    ماه

    بدون برترین ارسال کننده‌های این ماه.

    سال گذشته

    بدون برترین ارسال کننده‌ها این سال.

    تمامی زمانها

    1. mahdi1375
      mahdi1375
      1 فایل  · 
    2. Omid Zakeri
      Omid Zakeri
      8 فایل  · 
    3. کاریاب هوشمند
      کاریاب هوشمند
      1 فایل  · 
    4. amirsh
      amirsh
      5 فایل  · 
    5. Amir2115
      Amir2115
      4 فایل  · 

  • نظر فایل

  • آمارهای بخش دریافت

    • فایل‌ها
      54
    • دیدگاه
      7
    • نقد
      21

  • پست ها

    • سلام هنگام اجرا برنامه این مشکل به وجود میاد و اپ ایجاد نمیشه داخل شبیه ساز اندروید و همش ای خطا ها برام میاد چیکار کنم لطفا تا فردا پاسخ دهید چون پروژه استادم رو باید تحویل دهم لطفا سریع جوابم رو بدین  Executing tasks: [:app:assembleDebug] in project E:\MyApplication > Task :app:createDebugVariantModel UP-TO-DATE > Task :app:preBuild UP-TO-DATE > Task :app:preDebugBuild UP-TO-DATE > Task :app:mergeDebugNativeDebugMetadata NO-SOURCE > Task :app:dataBindingMergeDependencyArtifactsDebug UP-TO-DATE > Task :app:generateDebugResValues UP-TO-DATE > Task :app:generateDebugResources UP-TO-DATE > Task :app:packageDebugResources > Task :app:javaPreCompileDebug UP-TO-DATE > Task :app:checkDebugAarMetadata UP-TO-DATE > Task :app:mergeDebugResources > Task :app:mapDebugSourceSetPaths > Task :app:createDebugCompatibleScreenManifests UP-TO-DATE > Task :app:extractDeepLinksDebug UP-TO-DATE > Task :app:processDebugMainManifest UP-TO-DATE > Task :app:processDebugManifest UP-TO-DATE > Task :app:processDebugManifestForPackage UP-TO-DATE > Task :app:mergeDebugShaders UP-TO-DATE > Task :app:compileDebugShaders NO-SOURCE > Task :app:generateDebugAssets UP-TO-DATE > Task :app:mergeDebugAssets UP-TO-DATE > Task :app:compressDebugAssets UP-TO-DATE > Task :app:processDebugJavaRes NO-SOURCE > Task :app:mergeDebugJavaResource UP-TO-DATE > Task :app:checkDebugDuplicateClasses FAILED > Task :app:desugarDebugFileDependencies UP-TO-DATE > Task :app:mergeDebugJniLibFolders UP-TO-DATE > Task :app:mergeDebugNativeLibs NO-SOURCE > Task :app:stripDebugDebugSymbols NO-SOURCE > Task :app:validateSigningDebug UP-TO-DATE > Task :app:writeDebugAppMetadata UP-TO-DATE > Task :app:writeDebugSigningConfigVersions UP-TO-DATE > Task :app:parseDebugLocalResources > Task :app:dataBindingGenBaseClassesDebug > Task :app:processDebugResources FAILED FAILURE: Build completed with 2 failures. 1: Task failed with an exception. ----------- * What went wrong: Execution failed for task ':app:checkDebugDuplicateClasses'. > A failure occurred while executing com.android.build.gradle.internal.tasks.CheckDuplicatesRunnable    > Duplicate class kotlin.collections.jdk8.CollectionsJDK8Kt found in modules kotlin-stdlib-1.8.10 (org.jetbrains.kotlin:kotlin-stdlib:1.8.10) and kotlin-stdlib-jdk8-1.6.21 (org.jetbrains.kotlin:kotlin-stdlib-jdk8:1.6.21)      Duplicate class kotlin.internal.jdk7.JDK7PlatformImplementations found in modules kotlin-stdlib-1.8.10 (org.jetbrains.kotlin:kotlin-stdlib:1.8.10) and kotlin-stdlib-jdk7-1.6.21 (org.jetbrains.kotlin:kotlin-stdlib-jdk7:1.6.21)      Duplicate class kotlin.internal.jdk7.JDK7PlatformImplementations$ReflectSdkVersion found in modules kotlin-stdlib-1.8.10 (org.jetbrains.kotlin:kotlin-stdlib:1.8.10) and kotlin-stdlib-jdk7-1.6.21 (org.jetbrains.kotlin:kotlin-stdlib-jdk7:1.6.21)      Duplicate class kotlin.internal.jdk8.JDK8PlatformImplementations found in modules kotlin-stdlib-1.8.10 (org.jetbrains.kotlin:kotlin-stdlib:1.8.10) and kotlin-stdlib-jdk8-1.6.21 (org.jetbrains.kotlin:kotlin-stdlib-jdk8:1.6.21)      Duplicate class kotlin.internal.jdk8.JDK8PlatformImplementations$ReflectSdkVersion found in modules kotlin-stdlib-1.8.10 (org.jetbrains.kotlin:kotlin-stdlib:1.8.10) and kotlin-stdlib-jdk8-1.6.21 (org.jetbrains.kotlin:kotlin-stdlib-jdk8:1.6.21)      Duplicate class kotlin.io.path.ExperimentalPathApi found in modules kotlin-stdlib-1.8.10 (org.jetbrains.kotlin:kotlin-stdlib:1.8.10) and kotlin-stdlib-jdk7-1.6.21 (org.jetbrains.kotlin:kotlin-stdlib-jdk7:1.6.21)      Duplicate class kotlin.io.path.PathRelativizer found in modules kotlin-stdlib-1.8.10 (org.jetbrains.kotlin:kotlin-stdlib:1.8.10) and kotlin-stdlib-jdk7-1.6.21 (org.jetbrains.kotlin:kotlin-stdlib-jdk7:1.6.21)      Duplicate class kotlin.io.path.PathsKt found in modules kotlin-stdlib-1.8.10 (org.jetbrains.kotlin:kotlin-stdlib:1.8.10) and kotlin-stdlib-jdk7-1.6.21 (org.jetbrains.kotlin:kotlin-stdlib-jdk7:1.6.21)      Duplicate class kotlin.io.path.PathsKt__PathReadWriteKt found in modules kotlin-stdlib-1.8.10 (org.jetbrains.kotlin:kotlin-stdlib:1.8.10) and kotlin-stdlib-jdk7-1.6.21 (org.jetbrains.kotlin:kotlin-stdlib-jdk7:1.6.21)      Duplicate class kotlin.io.path.PathsKt__PathUtilsKt found in modules kotlin-stdlib-1.8.10 (org.jetbrains.kotlin:kotlin-stdlib:1.8.10) and kotlin-stdlib-jdk7-1.6.21 (org.jetbrains.kotlin:kotlin-stdlib-jdk7:1.6.21)      Duplicate class kotlin.jdk7.AutoCloseableKt found in modules kotlin-stdlib-1.8.10 (org.jetbrains.kotlin:kotlin-stdlib:1.8.10) and kotlin-stdlib-jdk7-1.6.21 (org.jetbrains.kotlin:kotlin-stdlib-jdk7:1.6.21)      Duplicate class kotlin.jvm.jdk8.JvmRepeatableKt found in modules kotlin-stdlib-1.8.10 (org.jetbrains.kotlin:kotlin-stdlib:1.8.10) and kotlin-stdlib-jdk8-1.6.21 (org.jetbrains.kotlin:kotlin-stdlib-jdk8:1.6.21)      Duplicate class kotlin.random.jdk8.PlatformThreadLocalRandom found in modules kotlin-stdlib-1.8.10 (org.jetbrains.kotlin:kotlin-stdlib:1.8.10) and kotlin-stdlib-jdk8-1.6.21 (org.jetbrains.kotlin:kotlin-stdlib-jdk8:1.6.21)      Duplicate class kotlin.streams.jdk8.StreamsKt found in modules kotlin-stdlib-1.8.10 (org.jetbrains.kotlin:kotlin-stdlib:1.8.10) and kotlin-stdlib-jdk8-1.6.21 (org.jetbrains.kotlin:kotlin-stdlib-jdk8:1.6.21)      Duplicate class kotlin.streams.jdk8.StreamsKt$asSequence$$inlined$Sequence$1 found in modules kotlin-stdlib-1.8.10 (org.jetbrains.kotlin:kotlin-stdlib:1.8.10) and kotlin-stdlib-jdk8-1.6.21 (org.jetbrains.kotlin:kotlin-stdlib-jdk8:1.6.21)      Duplicate class kotlin.streams.jdk8.StreamsKt$asSequence$$inlined$Sequence$2 found in modules kotlin-stdlib-1.8.10 (org.jetbrains.kotlin:kotlin-stdlib:1.8.10) and kotlin-stdlib-jdk8-1.6.21 (org.jetbrains.kotlin:kotlin-stdlib-jdk8:1.6.21)      Duplicate class kotlin.streams.jdk8.StreamsKt$asSequence$$inlined$Sequence$3 found in modules kotlin-stdlib-1.8.10 (org.jetbrains.kotlin:kotlin-stdlib:1.8.10) and kotlin-stdlib-jdk8-1.6.21 (org.jetbrains.kotlin:kotlin-stdlib-jdk8:1.6.21)      Duplicate class kotlin.streams.jdk8.StreamsKt$asSequence$$inlined$Sequence$4 found in modules kotlin-stdlib-1.8.10 (org.jetbrains.kotlin:kotlin-stdlib:1.8.10) and kotlin-stdlib-jdk8-1.6.21 (org.jetbrains.kotlin:kotlin-stdlib-jdk8:1.6.21)      Duplicate class kotlin.text.jdk8.RegexExtensionsJDK8Kt found in modules kotlin-stdlib-1.8.10 (org.jetbrains.kotlin:kotlin-stdlib:1.8.10) and kotlin-stdlib-jdk8-1.6.21 (org.jetbrains.kotlin:kotlin-stdlib-jdk8:1.6.21)      Duplicate class kotlin.time.jdk8.DurationConversionsJDK8Kt found in modules kotlin-stdlib-1.8.10 (org.jetbrains.kotlin:kotlin-stdlib:1.8.10) and kotlin-stdlib-jdk8-1.6.21 (org.jetbrains.kotlin:kotlin-stdlib-jdk8:1.6.21)            Go to the documentation to learn how to <a href="d.android.com/r/tools/classpath-sync-errors">Fix dependency resolution errors</a>. * Try: > Run with --info or --debug option to get more log output. > Run with --scan to get full insights. * Exception is: org.gradle.api.tasks.TaskExecutionException: Execution failed for task ':app:checkDebugDuplicateClasses'.     at org.gradle.api.internal.tasks.execution.ExecuteActionsTaskExecuter.lambda$executeIfValid$1(ExecuteActionsTaskExecuter.java:149)     at org.gradle.internal.Try$Failure.ifSuccessfulOrElse(Try.java:282)     at org.gradle.api.internal.tasks.execution.ExecuteActionsTaskExecuter.executeIfValid(ExecuteActionsTaskExecuter.java:147)     at org.gradle.api.internal.tasks.execution.ExecuteActionsTaskExecuter.execute(ExecuteActionsTaskExecuter.java:135)     at org.gradle.api.internal.tasks.execution.FinalizePropertiesTaskExecuter.execute(FinalizePropertiesTaskExecuter.java:46)     at org.gradle.api.internal.tasks.execution.ResolveTaskExecutionModeExecuter.execute(ResolveTaskExecutionModeExecuter.java:51)     at org.gradle.api.internal.tasks.execution.SkipTaskWithNoActionsExecuter.execute(SkipTaskWithNoActionsExecuter.java:57)     at org.gradle.api.internal.tasks.execution.SkipOnlyIfTaskExecuter.execute(SkipOnlyIfTaskExecuter.java:74)     at org.gradle.api.internal.tasks.execution.CatchExceptionTaskExecuter.execute(CatchExceptionTaskExecuter.java:36)     at org.gradle.api.internal.tasks.execution.EventFiringTaskExecuter$1.executeTask(EventFiringTaskExecuter.java:77)     at org.gradle.api.internal.tasks.execution.EventFiringTaskExecuter$1.call(EventFiringTaskExecuter.java:55)     at org.gradle.api.internal.tasks.execution.EventFiringTaskExecuter$1.call(EventFiringTaskExecuter.java:52)     at org.gradle.internal.operations.DefaultBuildOperationRunner$CallableBuildOperationWorker.execute(DefaultBuildOperationRunner.java:204)     at org.gradle.internal.operations.DefaultBuildOperationRunner$CallableBuildOperationWorker.execute(DefaultBuildOperationRunner.java:199)     at org.gradle.internal.operations.DefaultBuildOperationRunner$2.execute(DefaultBuildOperationRunner.java:66)     at org.gradle.internal.operations.DefaultBuildOperationRunner$2.execute(DefaultBuildOperationRunner.java:59)     at org.gradle.internal.operations.DefaultBuildOperationRunner.execute(DefaultBuildOperationRunner.java:157)     at org.gradle.internal.operations.DefaultBuildOperationRunner.execute(DefaultBuildOperationRunner.java:59)     at org.gradle.internal.operations.DefaultBuildOperationRunner.call(DefaultBuildOperationRunner.java:53)     at org.gradle.internal.operations.DefaultBuildOperationExecutor.call(DefaultBuildOperationExecutor.java:73)     at org.gradle.api.internal.tasks.execution.EventFiringTaskExecuter.execute(EventFiringTaskExecuter.java:52)     at org.gradle.execution.plan.LocalTaskNodeExecutor.execute(LocalTaskNodeExecutor.java:42)     at org.gradle.execution.taskgraph.DefaultTaskExecutionGraph$InvokeNodeExecutorsAction.execute(DefaultTaskExecutionGraph.java:338)     at org.gradle.execution.taskgraph.DefaultTaskExecutionGraph$InvokeNodeExecutorsAction.execute(DefaultTaskExecutionGraph.java:325)     at org.gradle.execution.taskgraph.DefaultTaskExecutionGraph$BuildOperationAwareExecutionAction.execute(DefaultTaskExecutionGraph.java:318)     at org.gradle.execution.taskgraph.DefaultTaskExecutionGraph$BuildOperationAwareExecutionAction.execute(DefaultTaskExecutionGraph.java:304)     at org.gradle.execution.plan.DefaultPlanExecutor$ExecutorWorker.execute(DefaultPlanExecutor.java:463)     at org.gradle.execution.plan.DefaultPlanExecutor$ExecutorWorker.run(DefaultPlanExecutor.java:380)     at org.gradle.execution.plan.DefaultPlanExecutor.process(DefaultPlanExecutor.java:116)     at org.gradle.execution.taskgraph.DefaultTaskExecutionGraph.executeWithServices(DefaultTaskExecutionGraph.java:136)     at org.gradle.execution.taskgraph.DefaultTaskExecutionGraph.execute(DefaultTaskExecutionGraph.java:121)     at org.gradle.execution.SelectedTaskExecutionAction.execute(SelectedTaskExecutionAction.java:35)     at org.gradle.execution.DryRunBuildExecutionAction.execute(DryRunBuildExecutionAction.java:51)     at org.gradle.execution.BuildOperationFiringBuildWorkerExecutor$ExecuteTasks.call(BuildOperationFiringBuildWorkerExecutor.java:54)     at org.gradle.execution.BuildOperationFiringBuildWorkerExecutor$ExecuteTasks.call(BuildOperationFiringBuildWorkerExecutor.java:43)     at org.gradle.internal.operations.DefaultBuildOperationRunner$CallableBuildOperationWorker.execute(DefaultBuildOperationRunner.java:204)     at org.gradle.internal.operations.DefaultBuildOperationRunner$CallableBuildOperationWorker.execute(DefaultBuildOperationRunner.java:199)     at org.gradle.internal.operations.DefaultBuildOperationRunner$2.execute(DefaultBuildOperationRunner.java:66)     at org.gradle.internal.operations.DefaultBuildOperationRunner$2.execute(DefaultBuildOperationRunner.java:59)     at org.gradle.internal.operations.DefaultBuildOperationRunner.execute(DefaultBuildOperationRunner.java:157)     at org.gradle.internal.operations.DefaultBuildOperationRunner.execute(DefaultBuildOperationRunner.java:59)     at org.gradle.internal.operations.DefaultBuildOperationRunner.call(DefaultBuildOperationRunner.java:53)     at org.gradle.internal.operations.DefaultBuildOperationExecutor.call(DefaultBuildOperationExecutor.java:73)     at org.gradle.execution.BuildOperationFiringBuildWorkerExecutor.execute(BuildOperationFiringBuildWorkerExecutor.java:40)     at org.gradle.internal.build.DefaultBuildLifecycleController.lambda$executeTasks$7(DefaultBuildLifecycleController.java:172)     at org.gradle.internal.model.StateTransitionController.doTransition(StateTransitionController.java:258)     at org.gradle.internal.model.StateTransitionController.lambda$tryTransition$8(StateTransitionController.java:185)     at org.gradle.internal.work.DefaultSynchronizer.withLock(DefaultSynchronizer.java:44)     at org.gradle.internal.model.StateTransitionController.tryTransition(StateTransitionController.java:185)     at org.gradle.internal.build.DefaultBuildLifecycleController.executeTasks(DefaultBuildLifecycleController.java:172)     at org.gradle.internal.build.DefaultBuildWorkGraphController$DefaultBuildWorkGraph.runWork(DefaultBuildWorkGraphController.java:209)     at org.gradle.internal.work.DefaultWorkerLeaseService.withLocks(DefaultWorkerLeaseService.java:249)     at org.gradle.internal.work.DefaultWorkerLeaseService.runAsWorkerThread(DefaultWorkerLeaseService.java:109)     at org.gradle.composite.internal.DefaultBuildController.doRun(DefaultBuildController.java:172)     at org.gradle.composite.internal.DefaultBuildController.access$000(DefaultBuildController.java:47)     at org.gradle.composite.internal.DefaultBuildController$BuildOpRunnable.run(DefaultBuildController.java:191)     at org.gradle.internal.concurrent.ExecutorPolicy$CatchAndRecordFailures.onExecute(ExecutorPolicy.java:64)     at org.gradle.internal.concurrent.ManagedExecutorImpl$1.run(ManagedExecutorImpl.java:49) Caused by: org.gradle.workers.internal.DefaultWorkerExecutor$WorkExecutionException: A failure occurred while executing com.android.build.gradle.internal.tasks.CheckDuplicatesRunnable     at org.gradle.workers.internal.DefaultWorkerExecutor$WorkItemExecution.waitForCompletion(DefaultWorkerExecutor.java:283)     at org.gradle.internal.work.DefaultAsyncWorkTracker.lambda$waitForItemsAndGatherFailures$2(DefaultAsyncWorkTracker.java:130)     at org.gradle.internal.Factories$1.create(Factories.java:31)     at org.gradle.internal.work.DefaultWorkerLeaseService.withoutLocks(DefaultWorkerLeaseService.java:321)     at org.gradle.internal.work.DefaultWorkerLeaseService.withoutLocks(DefaultWorkerLeaseService.java:304)     at org.gradle.internal.work.DefaultWorkerLeaseService.withoutLock(DefaultWorkerLeaseService.java:309)     at org.gradle.internal.work.DefaultAsyncWorkTracker.waitForItemsAndGatherFailures(DefaultAsyncWorkTracker.java:126)     at org.gradle.internal.work.DefaultAsyncWorkTracker.waitForItemsAndGatherFailures(DefaultAsyncWorkTracker.java:92)     at org.gradle.internal.work.DefaultAsyncWorkTracker.waitForAll(DefaultAsyncWorkTracker.java:78)     at org.gradle.internal.work.DefaultAsyncWorkTracker.waitForCompletion(DefaultAsyncWorkTracker.java:66)     at org.gradle.api.internal.tasks.execution.TaskExecution$3.run(TaskExecution.java:250)     at org.gradle.internal.operations.DefaultBuildOperationRunner$1.execute(DefaultBuildOperationRunner.java:29)     at org.gradle.internal.operations.DefaultBuildOperationRunner$1.execute(DefaultBuildOperationRunner.java:26)     at org.gradle.internal.operations.DefaultBuildOperationRunner$2.execute(DefaultBuildOperationRunner.java:66)     at org.gradle.internal.operations.DefaultBuildOperationRunner$2.execute(DefaultBuildOperationRunner.java:59)     at org.gradle.internal.operations.DefaultBuildOperationRunner.execute(DefaultBuildOperationRunner.java:157)     at org.gradle.internal.operations.DefaultBuildOperationRunner.execute(DefaultBuildOperationRunner.java:59)     at org.gradle.internal.operations.DefaultBuildOperationRunner.run(DefaultBuildOperationRunner.java:47)     at org.gradle.internal.operations.DefaultBuildOperationExecutor.run(DefaultBuildOperationExecutor.java:68)     at org.gradle.api.internal.tasks.execution.TaskExecution.executeAction(TaskExecution.java:227)     at org.gradle.api.internal.tasks.execution.TaskExecution.executeActions(TaskExecution.java:210)     at org.gradle.api.internal.tasks.execution.TaskExecution.executeWithPreviousOutputFiles(TaskExecution.java:193)     at org.gradle.api.internal.tasks.execution.TaskExecution.execute(TaskExecution.java:166)     at org.gradle.internal.execution.steps.ExecuteStep.executeInternal(ExecuteStep.java:93)     at org.gradle.internal.execution.steps.ExecuteStep.access$000(ExecuteStep.java:44)     at org.gradle.internal.execution.steps.ExecuteStep$1.call(ExecuteStep.java:57)     at org.gradle.internal.execution.steps.ExecuteStep$1.call(ExecuteStep.java:54)     at org.gradle.internal.operations.DefaultBuildOperationRunner$CallableBuildOperationWorker.execute(DefaultBuildOperationRunner.java:204)     at org.gradle.internal.operations.DefaultBuildOperationRunner$CallableBuildOperationWorker.execute(DefaultBuildOperationRunner.java:199)     at org.gradle.internal.operations.DefaultBuildOperationRunner$2.execute(DefaultBuildOperationRunner.java:66)     at org.gradle.internal.operations.DefaultBuildOperationRunner$2.execute(DefaultBuildOperationRunner.java:59)     at org.gradle.internal.operations.DefaultBuildOperationRunner.execute(DefaultBuildOperationRunner.java:157)     at org.gradle.internal.operations.DefaultBuildOperationRunner.execute(DefaultBuildOperationRunner.java:59)     at org.gradle.internal.operations.DefaultBuildOperationRunner.call(DefaultBuildOperationRunner.java:53)     at org.gradle.internal.operations.DefaultBuildOperationExecutor.call(DefaultBuildOperationExecutor.java:73)     at org.gradle.internal.execution.steps.ExecuteStep.execute(ExecuteStep.java:54)     at org.gradle.internal.execution.steps.ExecuteStep.execute(ExecuteStep.java:44)     at org.gradle.internal.execution.steps.RemovePreviousOutputsStep.execute(RemovePreviousOutputsStep.java:67)     at org.gradle.internal.execution.steps.RemovePreviousOutputsStep.execute(RemovePreviousOutputsStep.java:37)     at org.gradle.internal.execution.steps.CancelExecutionStep.execute(CancelExecutionStep.java:41)     at org.gradle.internal.execution.steps.TimeoutStep.executeWithoutTimeout(TimeoutStep.java:74)     at org.gradle.internal.execution.steps.TimeoutStep.execute(TimeoutStep.java:55)     at org.gradle.internal.execution.steps.CreateOutputsStep.execute(CreateOutputsStep.java:50)     at org.gradle.internal.execution.steps.CreateOutputsStep.execute(CreateOutputsStep.java:28)     at org.gradle.internal.execution.steps.CaptureStateAfterExecutionStep.executeDelegateBroadcastingChanges(CaptureStateAfterExecutionStep.java:100)     at org.gradle.internal.execution.steps.CaptureStateAfterExecutionStep.execute(CaptureStateAfterExecutionStep.java:72)     at org.gradle.internal.execution.steps.CaptureStateAfterExecutionStep.execute(CaptureStateAfterExecutionStep.java:50)     at org.gradle.internal.execution.steps.ResolveInputChangesStep.execute(ResolveInputChangesStep.java:40)     at org.gradle.internal.execution.steps.ResolveInputChangesStep.execute(ResolveInputChangesStep.java:29)     at org.gradle.internal.execution.steps.BuildCacheStep.executeWithoutCache(BuildCacheStep.java:166)     at org.gradle.internal.execution.steps.BuildCacheStep.lambda$execute$1(BuildCacheStep.java:70)     at org.gradle.internal.Either$Right.fold(Either.java:175)     at org.gradle.internal.execution.caching.CachingState.fold(CachingState.java:59)     at org.gradle.internal.execution.steps.BuildCacheStep.execute(BuildCacheStep.java:68)     at org.gradle.internal.execution.steps.BuildCacheStep.execute(BuildCacheStep.java:46)     at org.gradle.internal.execution.steps.StoreExecutionStateStep.execute(StoreExecutionStateStep.java:36)     at org.gradle.internal.execution.steps.StoreExecutionStateStep.execute(StoreExecutionStateStep.java:25)     at org.gradle.internal.execution.steps.RecordOutputsStep.execute(RecordOutputsStep.java:36)     at org.gradle.internal.execution.steps.RecordOutputsStep.execute(RecordOutputsStep.java:22)     at org.gradle.internal.execution.steps.SkipUpToDateStep.executeBecause(SkipUpToDateStep.java:91)     at org.gradle.internal.execution.steps.SkipUpToDateStep.lambda$execute$2(SkipUpToDateStep.java:55)     at org.gradle.internal.execution.steps.SkipUpToDateStep.execute(SkipUpToDateStep.java:55)     at org.gradle.internal.execution.steps.SkipUpToDateStep.execute(SkipUpToDateStep.java:37)     at org.gradle.internal.execution.steps.ResolveChangesStep.execute(ResolveChangesStep.java:65)     at org.gradle.internal.execution.steps.ResolveChangesStep.execute(ResolveChangesStep.java:36)     at org.gradle.internal.execution.steps.legacy.MarkSnapshottingInputsFinishedStep.execute(MarkSnapshottingInputsFinishedStep.java:37)     at org.gradle.internal.execution.steps.legacy.MarkSnapshottingInputsFinishedStep.execute(MarkSnapshottingInputsFinishedStep.java:27)     at org.gradle.internal.execution.steps.ResolveCachingStateStep.execute(ResolveCachingStateStep.java:76)     at org.gradle.internal.execution.steps.ResolveCachingStateStep.execute(ResolveCachingStateStep.java:37)     at org.gradle.internal.execution.steps.ValidateStep.execute(ValidateStep.java:94)     at org.gradle.internal.execution.steps.ValidateStep.execute(ValidateStep.java:49)     at org.gradle.internal.execution.steps.CaptureStateBeforeExecutionStep.execute(CaptureStateBeforeExecutionStep.java:71)     at org.gradle.internal.execution.steps.CaptureStateBeforeExecutionStep.execute(CaptureStateBeforeExecutionStep.java:45)     at org.gradle.internal.execution.steps.SkipEmptyWorkStep.executeWithNonEmptySources(SkipEmptyWorkStep.java:177)     at org.gradle.internal.execution.steps.SkipEmptyWorkStep.execute(SkipEmptyWorkStep.java:81)     at org.gradle.internal.execution.steps.SkipEmptyWorkStep.execute(SkipEmptyWorkStep.java:53)     at org.gradle.internal.execution.steps.RemoveUntrackedExecutionStateStep.execute(RemoveUntrackedExecutionStateStep.java:32)     at org.gradle.internal.execution.steps.RemoveUntrackedExecutionStateStep.execute(RemoveUntrackedExecutionStateStep.java:21)     at org.gradle.internal.execution.steps.legacy.MarkSnapshottingInputsStartedStep.execute(MarkSnapshottingInputsStartedStep.java:38)     at org.gradle.internal.execution.steps.LoadPreviousExecutionStateStep.execute(LoadPreviousExecutionStateStep.java:36)     at org.gradle.internal.execution.steps.LoadPreviousExecutionStateStep.execute(LoadPreviousExecutionStateStep.java:23)     at org.gradle.internal.execution.steps.CleanupStaleOutputsStep.execute(CleanupStaleOutputsStep.java:75)     at org.gradle.internal.execution.steps.CleanupStaleOutputsStep.execute(CleanupStaleOutputsStep.java:41)     at org.gradle.internal.execution.steps.AssignWorkspaceStep.lambda$execute$0(AssignWorkspaceStep.java:32)     at org.gradle.api.internal.tasks.execution.TaskExecution$4.withWorkspace(TaskExecution.java:287)     at org.gradle.internal.execution.steps.AssignWorkspaceStep.execute(AssignWorkspaceStep.java:30)     at org.gradle.internal.execution.steps.AssignWorkspaceStep.execute(AssignWorkspaceStep.java:21)     at org.gradle.internal.execution.steps.IdentityCacheStep.execute(IdentityCacheStep.java:37)     at org.gradle.internal.execution.steps.IdentityCacheStep.execute(IdentityCacheStep.java:27)     at org.gradle.internal.execution.steps.IdentifyStep.execute(IdentifyStep.java:42)     at org.gradle.internal.execution.steps.IdentifyStep.execute(IdentifyStep.java:31)     at org.gradle.internal.execution.impl.DefaultExecutionEngine$1.execute(DefaultExecutionEngine.java:64)     at org.gradle.api.internal.tasks.execution.ExecuteActionsTaskExecuter.executeIfValid(ExecuteActionsTaskExecuter.java:146)     at org.gradle.api.internal.tasks.execution.ExecuteActionsTaskExecuter.execute(ExecuteActionsTaskExecuter.java:135)     at org.gradle.api.internal.tasks.execution.FinalizePropertiesTaskExecuter.execute(FinalizePropertiesTaskExecuter.java:46)     at org.gradle.api.internal.tasks.execution.ResolveTaskExecutionModeExecuter.execute(ResolveTaskExecutionModeExecuter.java:51)     at org.gradle.api.internal.tasks.execution.SkipTaskWithNoActionsExecuter.execute(SkipTaskWithNoActionsExecuter.java:57)     at org.gradle.api.internal.tasks.execution.SkipOnlyIfTaskExecuter.execute(SkipOnlyIfTaskExecuter.java:74)     at org.gradle.api.internal.tasks.execution.CatchExceptionTaskExecuter.execute(CatchExceptionTaskExecuter.java:36)     at org.gradle.api.internal.tasks.execution.EventFiringTaskExecuter$1.executeTask(EventFiringTaskExecuter.java:77)     at org.gradle.api.internal.tasks.execution.EventFiringTaskExecuter$1.call(EventFiringTaskExecuter.java:55)     at org.gradle.api.internal.tasks.execution.EventFiringTaskExecuter$1.call(EventFiringTaskExecuter.java:52)     at org.gradle.internal.operations.DefaultBuildOperationRunner$CallableBuildOperationWorker.execute(DefaultBuildOperationRunner.java:204)     at org.gradle.internal.operations.DefaultBuildOperationRunner$CallableBuildOperationWorker.execute(DefaultBuildOperationRunner.java:199)     at org.gradle.internal.operations.DefaultBuildOperationRunner$2.execute(DefaultBuildOperationRunner.java:66)     at org.gradle.internal.operations.DefaultBuildOperationRunner$2.execute(DefaultBuildOperationRunner.java:59)     at org.gradle.internal.operations.DefaultBuildOperationRunner.execute(DefaultBuildOperationRunner.java:157)     at org.gradle.internal.operations.DefaultBuildOperationRunner.execute(DefaultBuildOperationRunner.java:59)     at org.gradle.internal.operations.DefaultBuildOperationRunner.call(DefaultBuildOperationRunner.java:53)     at org.gradle.internal.operations.DefaultBuildOperationExecutor.call(DefaultBuildOperationExecutor.java:73)     at org.gradle.api.internal.tasks.execution.EventFiringTaskExecuter.execute(EventFiringTaskExecuter.java:52)     at org.gradle.execution.plan.LocalTaskNodeExecutor.execute(LocalTaskNodeExecutor.java:42)     at org.gradle.execution.taskgraph.DefaultTaskExecutionGraph$InvokeNodeExecutorsAction.execute(DefaultTaskExecutionGraph.java:338)     at org.gradle.execution.taskgraph.DefaultTaskExecutionGraph$InvokeNodeExecutorsAction.execute(DefaultTaskExecutionGraph.java:325)     at org.gradle.execution.taskgraph.DefaultTaskExecutionGraph$BuildOperationAwareExecutionAction.execute(DefaultTaskExecutionGraph.java:318)     at org.gradle.execution.taskgraph.DefaultTaskExecutionGraph$BuildOperationAwareExecutionAction.execute(DefaultTaskExecutionGraph.java:304)     at org.gradle.execution.plan.DefaultPlanExecutor$ExecutorWorker.execute(DefaultPlanExecutor.java:463)     at org.gradle.execution.plan.DefaultPlanExecutor$ExecutorWorker.run(DefaultPlanExecutor.java:380)     at org.gradle.execution.plan.DefaultPlanExecutor.process(DefaultPlanExecutor.java:116)     at org.gradle.execution.taskgraph.DefaultTaskExecutionGraph.executeWithServices(DefaultTaskExecutionGraph.java:136)     at org.gradle.execution.taskgraph.DefaultTaskExecutionGraph.execute(DefaultTaskExecutionGraph.java:121)     at org.gradle.execution.SelectedTaskExecutionAction.execute(SelectedTaskExecutionAction.java:35)     at org.gradle.execution.DryRunBuildExecutionAction.execute(DryRunBuildExecutionAction.java:51)     at org.gradle.execution.BuildOperationFiringBuildWorkerExecutor$ExecuteTasks.call(BuildOperationFiringBuildWorkerExecutor.java:54)     at org.gradle.execution.BuildOperationFiringBuildWorkerExecutor$ExecuteTasks.call(BuildOperationFiringBuildWorkerExecutor.java:43)     at org.gradle.internal.operations.DefaultBuildOperationRunner$CallableBuildOperationWorker.execute(DefaultBuildOperationRunner.java:204)     at org.gradle.internal.operations.DefaultBuildOperationRunner$CallableBuildOperationWorker.execute(DefaultBuildOperationRunner.java:199)     at org.gradle.internal.operations.DefaultBuildOperationRunner$2.execute(DefaultBuildOperationRunner.java:66)     at org.gradle.internal.operations.DefaultBuildOperationRunner$2.execute(DefaultBuildOperationRunner.java:59)     at org.gradle.internal.operations.DefaultBuildOperationRunner.execute(DefaultBuildOperationRunner.java:157)     at org.gradle.internal.operations.DefaultBuildOperationRunner.execute(DefaultBuildOperationRunner.java:59)     at org.gradle.internal.operations.DefaultBuildOperationRunner.call(DefaultBuildOperationRunner.java:53)     at org.gradle.internal.operations.DefaultBuildOperationExecutor.call(DefaultBuildOperationExecutor.java:73)     at org.gradle.execution.BuildOperationFiringBuildWorkerExecutor.execute(BuildOperationFiringBuildWorkerExecutor.java:40)     at org.gradle.internal.build.DefaultBuildLifecycleController.lambda$executeTasks$7(DefaultBuildLifecycleController.java:172)     at org.gradle.internal.model.StateTransitionController.doTransition(StateTransitionController.java:258)     at org.gradle.internal.model.StateTransitionController.lambda$tryTransition$8(StateTransitionController.java:185)     at org.gradle.internal.work.DefaultSynchronizer.withLock(DefaultSynchronizer.java:44)     at org.gradle.internal.model.StateTransitionController.tryTransition(StateTransitionController.java:185)     at org.gradle.internal.build.DefaultBuildLifecycleController.executeTasks(DefaultBuildLifecycleController.java:172)     at org.gradle.internal.build.DefaultBuildWorkGraphController$DefaultBuildWorkGraph.runWork(DefaultBuildWorkGraphController.java:209)     at org.gradle.internal.work.DefaultWorkerLeaseService.withLocks(DefaultWorkerLeaseService.java:249)     at org.gradle.internal.work.DefaultWorkerLeaseService.runAsWorkerThread(DefaultWorkerLeaseService.java:109)     at org.gradle.composite.internal.DefaultBuildController.doRun(DefaultBuildController.java:172)     at org.gradle.composite.internal.DefaultBuildController.access$000(DefaultBuildController.java:47)     at org.gradle.composite.internal.DefaultBuildController$BuildOpRunnable.run(DefaultBuildController.java:191)     at org.gradle.internal.concurrent.ExecutorPolicy$CatchAndRecordFailures.onExecute(ExecutorPolicy.java:64)     at org.gradle.internal.concurrent.ManagedExecutorImpl$1.run(ManagedExecutorImpl.java:49) Caused by: java.lang.RuntimeException: Duplicate class kotlin.collections.jdk8.CollectionsJDK8Kt found in modules kotlin-stdlib-1.8.10 (org.jetbrains.kotlin:kotlin-stdlib:1.8.10) and kotlin-stdlib-jdk8-1.6.21 (org.jetbrains.kotlin:kotlin-stdlib-jdk8:1.6.21) Duplicate class kotlin.internal.jdk7.JDK7PlatformImplementations found in modules kotlin-stdlib-1.8.10 (org.jetbrains.kotlin:kotlin-stdlib:1.8.10) and kotlin-stdlib-jdk7-1.6.21 (org.jetbrains.kotlin:kotlin-stdlib-jdk7:1.6.21) Duplicate class kotlin.internal.jdk7.JDK7PlatformImplementations$ReflectSdkVersion found in modules kotlin-stdlib-1.8.10 (org.jetbrains.kotlin:kotlin-stdlib:1.8.10) and kotlin-stdlib-jdk7-1.6.21 (org.jetbrains.kotlin:kotlin-stdlib-jdk7:1.6.21) Duplicate class kotlin.internal.jdk8.JDK8PlatformImplementations found in modules kotlin-stdlib-1.8.10 (org.jetbrains.kotlin:kotlin-stdlib:1.8.10) and kotlin-stdlib-jdk8-1.6.21 (org.jetbrains.kotlin:kotlin-stdlib-jdk8:1.6.21) Duplicate class kotlin.internal.jdk8.JDK8PlatformImplementations$ReflectSdkVersion found in modules kotlin-stdlib-1.8.10 (org.jetbrains.kotlin:kotlin-stdlib:1.8.10) and kotlin-stdlib-jdk8-1.6.21 (org.jetbrains.kotlin:kotlin-stdlib-jdk8:1.6.21) Duplicate class kotlin.io.path.ExperimentalPathApi found in modules kotlin-stdlib-1.8.10 (org.jetbrains.kotlin:kotlin-stdlib:1.8.10) and kotlin-stdlib-jdk7-1.6.21 (org.jetbrains.kotlin:kotlin-stdlib-jdk7:1.6.21) Duplicate class kotlin.io.path.PathRelativizer found in modules kotlin-stdlib-1.8.10 (org.jetbrains.kotlin:kotlin-stdlib:1.8.10) and kotlin-stdlib-jdk7-1.6.21 (org.jetbrains.kotlin:kotlin-stdlib-jdk7:1.6.21) Duplicate class kotlin.io.path.PathsKt found in modules kotlin-stdlib-1.8.10 (org.jetbrains.kotlin:kotlin-stdlib:1.8.10) and kotlin-stdlib-jdk7-1.6.21 (org.jetbrains.kotlin:kotlin-stdlib-jdk7:1.6.21) Duplicate class kotlin.io.path.PathsKt__PathReadWriteKt found in modules kotlin-stdlib-1.8.10 (org.jetbrains.kotlin:kotlin-stdlib:1.8.10) and kotlin-stdlib-jdk7-1.6.21 (org.jetbrains.kotlin:kotlin-stdlib-jdk7:1.6.21) Duplicate class kotlin.io.path.PathsKt__PathUtilsKt found in modules kotlin-stdlib-1.8.10 (org.jetbrains.kotlin:kotlin-stdlib:1.8.10) and kotlin-stdlib-jdk7-1.6.21 (org.jetbrains.kotlin:kotlin-stdlib-jdk7:1.6.21) Duplicate class kotlin.jdk7.AutoCloseableKt found in modules kotlin-stdlib-1.8.10 (org.jetbrains.kotlin:kotlin-stdlib:1.8.10) and kotlin-stdlib-jdk7-1.6.21 (org.jetbrains.kotlin:kotlin-stdlib-jdk7:1.6.21) Duplicate class kotlin.jvm.jdk8.JvmRepeatableKt found in modules kotlin-stdlib-1.8.10 (org.jetbrains.kotlin:kotlin-stdlib:1.8.10) and kotlin-stdlib-jdk8-1.6.21 (org.jetbrains.kotlin:kotlin-stdlib-jdk8:1.6.21) Duplicate class kotlin.random.jdk8.PlatformThreadLocalRandom found in modules kotlin-stdlib-1.8.10 (org.jetbrains.kotlin:kotlin-stdlib:1.8.10) and kotlin-stdlib-jdk8-1.6.21 (org.jetbrains.kotlin:kotlin-stdlib-jdk8:1.6.21) Duplicate class kotlin.streams.jdk8.StreamsKt found in modules kotlin-stdlib-1.8.10 (org.jetbrains.kotlin:kotlin-stdlib:1.8.10) and kotlin-stdlib-jdk8-1.6.21 (org.jetbrains.kotlin:kotlin-stdlib-jdk8:1.6.21) Duplicate class kotlin.streams.jdk8.StreamsKt$asSequence$$inlined$Sequence$1 found in modules kotlin-stdlib-1.8.10 (org.jetbrains.kotlin:kotlin-stdlib:1.8.10) and kotlin-stdlib-jdk8-1.6.21 (org.jetbrains.kotlin:kotlin-stdlib-jdk8:1.6.21) Duplicate class kotlin.streams.jdk8.StreamsKt$asSequence$$inlined$Sequence$2 found in modules kotlin-stdlib-1.8.10 (org.jetbrains.kotlin:kotlin-stdlib:1.8.10) and kotlin-stdlib-jdk8-1.6.21 (org.jetbrains.kotlin:kotlin-stdlib-jdk8:1.6.21) Duplicate class kotlin.streams.jdk8.StreamsKt$asSequence$$inlined$Sequence$3 found in modules kotlin-stdlib-1.8.10 (org.jetbrains.kotlin:kotlin-stdlib:1.8.10) and kotlin-stdlib-jdk8-1.6.21 (org.jetbrains.kotlin:kotlin-stdlib-jdk8:1.6.21) Duplicate class kotlin.streams.jdk8.StreamsKt$asSequence$$inlined$Sequence$4 found in modules kotlin-stdlib-1.8.10 (org.jetbrains.kotlin:kotlin-stdlib:1.8.10) and kotlin-stdlib-jdk8-1.6.21 (org.jetbrains.kotlin:kotlin-stdlib-jdk8:1.6.21) Duplicate class kotlin.text.jdk8.RegexExtensionsJDK8Kt found in modules kotlin-stdlib-1.8.10 (org.jetbrains.kotlin:kotlin-stdlib:1.8.10) and kotlin-stdlib-jdk8-1.6.21 (org.jetbrains.kotlin:kotlin-stdlib-jdk8:1.6.21) Duplicate class kotlin.time.jdk8.DurationConversionsJDK8Kt found in modules kotlin-stdlib-1.8.10 (org.jetbrains.kotlin:kotlin-stdlib:1.8.10) and kotlin-stdlib-jdk8-1.6.21 (org.jetbrains.kotlin:kotlin-stdlib-jdk8:1.6.21) Go to the documentation to learn how to <a href="d.android.com/r/tools/classpath-sync-errors">Fix dependency resolution errors</a>.     at com.android.build.gradle.internal.tasks.CheckDuplicateClassesDelegate.run(CheckDuplicateClassesDelegate.kt:65)     at com.android.build.gradle.internal.tasks.CheckDuplicatesRunnable.execute(CheckDuplicateClassesDelegate.kt:91)     at org.gradle.workers.internal.DefaultWorkerServer.execute(DefaultWorkerServer.java:63)     at org.gradle.workers.internal.NoIsolationWorkerFactory$1$1.create(NoIsolationWorkerFactory.java:66)     at org.gradle.workers.internal.NoIsolationWorkerFactory$1$1.create(NoIsolationWorkerFactory.java:62)     at org.gradle.internal.classloader.ClassLoaderUtils.executeInClassloader(ClassLoaderUtils.java:100)     at org.gradle.workers.internal.NoIsolationWorkerFactory$1.lambda$execute$0(NoIsolationWorkerFactory.java:62)     at org.gradle.workers.internal.AbstractWorker$1.call(AbstractWorker.java:44)     at org.gradle.workers.internal.AbstractWorker$1.call(AbstractWorker.java:41)     at org.gradle.internal.operations.DefaultBuildOperationRunner$CallableBuildOperationWorker.execute(DefaultBuildOperationRunner.java:204)     at org.gradle.internal.operations.DefaultBuildOperationRunner$CallableBuildOperationWorker.execute(DefaultBuildOperationRunner.java:199)     at org.gradle.internal.operations.DefaultBuildOperationRunner$2.execute(DefaultBuildOperationRunner.java:66)     at org.gradle.internal.operations.DefaultBuildOperationRunner$2.execute(DefaultBuildOperationRunner.java:59)     at org.gradle.internal.operations.DefaultBuildOperationRunner.execute(DefaultBuildOperationRunner.java:157)     at org.gradle.internal.operations.DefaultBuildOperationRunner.execute(DefaultBuildOperationRunner.java:59)     at org.gradle.internal.operations.DefaultBuildOperationRunner.call(DefaultBuildOperationRunner.java:53)     at org.gradle.internal.operations.DefaultBuildOperationExecutor.call(DefaultBuildOperationExecutor.java:73)     at org.gradle.workers.internal.AbstractWorker.executeWrappedInBuildOperation(AbstractWorker.java:41)     at org.gradle.workers.internal.NoIsolationWorkerFactory$1.execute(NoIsolationWorkerFactory.java:59)     at org.gradle.workers.internal.DefaultWorkerExecutor.lambda$submitWork$0(DefaultWorkerExecutor.java:169)     at org.gradle.internal.work.DefaultConditionalExecutionQueue$ExecutionRunner.runExecution(DefaultConditionalExecutionQueue.java:187)     at org.gradle.internal.work.DefaultConditionalExecutionQueue$ExecutionRunner.access$700(DefaultConditionalExecutionQueue.java:120)     at org.gradle.internal.work.DefaultConditionalExecutionQueue$ExecutionRunner$1.run(DefaultConditionalExecutionQueue.java:162)     at org.gradle.internal.Factories$1.create(Factories.java:31)     at org.gradle.internal.work.DefaultWorkerLeaseService.withLocks(DefaultWorkerLeaseService.java:249)     at org.gradle.internal.work.DefaultWorkerLeaseService.runAsWorkerThread(DefaultWorkerLeaseService.java:109)     at org.gradle.internal.work.DefaultWorkerLeaseService.runAsWorkerThread(DefaultWorkerLeaseService.java:114)     at org.gradle.internal.work.DefaultConditionalExecutionQueue$ExecutionRunner.runBatch(DefaultConditionalExecutionQueue.java:157)     at org.gradle.internal.work.DefaultConditionalExecutionQueue$ExecutionRunner.run(DefaultConditionalExecutionQueue.java:126)     ... 2 more ============================================================================== 2: Task failed with an exception. ----------- * What went wrong: Execution failed for task ':app:processDebugResources'. > A failure occurred while executing com.android.build.gradle.internal.res.LinkApplicationAndroidResourcesTask$TaskAction    > Android resource linking failed      E:\MyApplication\app\build\intermediates\packaged_manifests\debug\AndroidManifest.xml:73: error: resource xml/actions (aka com.example.myapplication:xml/actions) not found.      error: failed processing manifest. * Try: > Run with --info or --debug option to get more log output. > Run with --scan to get full insights. * Exception is: org.gradle.api.tasks.TaskExecutionException: Execution failed for task ':app:processDebugResources'.     at org.gradle.api.internal.tasks.execution.ExecuteActionsTaskExecuter.lambda$executeIfValid$1(ExecuteActionsTaskExecuter.java:149)     at org.gradle.internal.Try$Failure.ifSuccessfulOrElse(Try.java:282)     at org.gradle.api.internal.tasks.execution.ExecuteActionsTaskExecuter.executeIfValid(ExecuteActionsTaskExecuter.java:147)     at org.gradle.api.internal.tasks.execution.ExecuteActionsTaskExecuter.execute(ExecuteActionsTaskExecuter.java:135)     at org.gradle.api.internal.tasks.execution.FinalizePropertiesTaskExecuter.execute(FinalizePropertiesTaskExecuter.java:46)     at org.gradle.api.internal.tasks.execution.ResolveTaskExecutionModeExecuter.execute(ResolveTaskExecutionModeExecuter.java:51)     at org.gradle.api.internal.tasks.execution.SkipTaskWithNoActionsExecuter.execute(SkipTaskWithNoActionsExecuter.java:57)     at org.gradle.api.internal.tasks.execution.SkipOnlyIfTaskExecuter.execute(SkipOnlyIfTaskExecuter.java:74)     at org.gradle.api.internal.tasks.execution.CatchExceptionTaskExecuter.execute(CatchExceptionTaskExecuter.java:36)     at org.gradle.api.internal.tasks.execution.EventFiringTaskExecuter$1.executeTask(EventFiringTaskExecuter.java:77)     at org.gradle.api.internal.tasks.execution.EventFiringTaskExecuter$1.call(EventFiringTaskExecuter.java:55)     at org.gradle.api.internal.tasks.execution.EventFiringTaskExecuter$1.call(EventFiringTaskExecuter.java:52)     at org.gradle.internal.operations.DefaultBuildOperationRunner$CallableBuildOperationWorker.execute(DefaultBuildOperationRunner.java:204)     at org.gradle.internal.operations.DefaultBuildOperationRunner$CallableBuildOperationWorker.execute(DefaultBuildOperationRunner.java:199)     at org.gradle.internal.operations.DefaultBuildOperationRunner$2.execute(DefaultBuildOperationRunner.java:66)     at org.gradle.internal.operations.DefaultBuildOperationRunner$2.execute(DefaultBuildOperationRunner.java:59)     at org.gradle.internal.operations.DefaultBuildOperationRunner.execute(DefaultBuildOperationRunner.java:157)     at org.gradle.internal.operations.DefaultBuildOperationRunner.execute(DefaultBuildOperationRunner.java:59)     at org.gradle.internal.operations.DefaultBuildOperationRunner.call(DefaultBuildOperationRunner.java:53)     at org.gradle.internal.operations.DefaultBuildOperationExecutor.call(DefaultBuildOperationExecutor.java:73)     at org.gradle.api.internal.tasks.execution.EventFiringTaskExecuter.execute(EventFiringTaskExecuter.java:52)     at org.gradle.execution.plan.LocalTaskNodeExecutor.execute(LocalTaskNodeExecutor.java:42)     at org.gradle.execution.taskgraph.DefaultTaskExecutionGraph$InvokeNodeExecutorsAction.execute(DefaultTaskExecutionGraph.java:338)     at org.gradle.execution.taskgraph.DefaultTaskExecutionGraph$InvokeNodeExecutorsAction.execute(DefaultTaskExecutionGraph.java:325)     at org.gradle.execution.taskgraph.DefaultTaskExecutionGraph$BuildOperationAwareExecutionAction.execute(DefaultTaskExecutionGraph.java:318)     at org.gradle.execution.taskgraph.DefaultTaskExecutionGraph$BuildOperationAwareExecutionAction.execute(DefaultTaskExecutionGraph.java:304)     at org.gradle.execution.plan.DefaultPlanExecutor$ExecutorWorker.execute(DefaultPlanExecutor.java:463)     at org.gradle.execution.plan.DefaultPlanExecutor$ExecutorWorker.run(DefaultPlanExecutor.java:380)     at org.gradle.internal.concurrent.ExecutorPolicy$CatchAndRecordFailures.onExecute(ExecutorPolicy.java:64)     at org.gradle.internal.concurrent.ManagedExecutorImpl$1.run(ManagedExecutorImpl.java:49)     at java.base/java.util.concurrent.ThreadPoolExecutor.runWorker(ThreadPoolExecutor.java:1136)     at java.base/java.util.concurrent.ThreadPoolExecutor$Worker.run(ThreadPoolExecutor.java:635)     at java.base/java.lang.Thread.run(Thread.java:833) Caused by: org.gradle.workers.internal.DefaultWorkerExecutor$WorkExecutionException: A failure occurred while executing com.android.build.gradle.internal.res.LinkApplicationAndroidResourcesTask$TaskAction     at org.gradle.workers.internal.DefaultWorkerExecutor$WorkItemExecution.waitForCompletion(DefaultWorkerExecutor.java:283)     at org.gradle.internal.work.DefaultAsyncWorkTracker.lambda$waitForItemsAndGatherFailures$2(DefaultAsyncWorkTracker.java:130)     at org.gradle.internal.Factories$1.create(Factories.java:31)     at org.gradle.internal.work.DefaultWorkerLeaseService.withoutLocks(DefaultWorkerLeaseService.java:321)     at org.gradle.internal.work.DefaultWorkerLeaseService.withoutLocks(DefaultWorkerLeaseService.java:304)     at org.gradle.internal.work.DefaultWorkerLeaseService.withoutLock(DefaultWorkerLeaseService.java:309)     at org.gradle.internal.work.DefaultAsyncWorkTracker.waitForItemsAndGatherFailures(DefaultAsyncWorkTracker.java:126)     at org.gradle.internal.work.DefaultAsyncWorkTracker.waitForItemsAndGatherFailures(DefaultAsyncWorkTracker.java:92)     at org.gradle.internal.work.DefaultAsyncWorkTracker.waitForAll(DefaultAsyncWorkTracker.java:78)     at org.gradle.internal.work.DefaultAsyncWorkTracker.waitForCompletion(DefaultAsyncWorkTracker.java:66)     at org.gradle.api.internal.tasks.execution.TaskExecution$3.run(TaskExecution.java:250)     at org.gradle.internal.operations.DefaultBuildOperationRunner$1.execute(DefaultBuildOperationRunner.java:29)     at org.gradle.internal.operations.DefaultBuildOperationRunner$1.execute(DefaultBuildOperationRunner.java:26)     at org.gradle.internal.operations.DefaultBuildOperationRunner$2.execute(DefaultBuildOperationRunner.java:66)     at org.gradle.internal.operations.DefaultBuildOperationRunner$2.execute(DefaultBuildOperationRunner.java:59)     at org.gradle.internal.operations.DefaultBuildOperationRunner.execute(DefaultBuildOperationRunner.java:157)     at org.gradle.internal.operations.DefaultBuildOperationRunner.execute(DefaultBuildOperationRunner.java:59)     at org.gradle.internal.operations.DefaultBuildOperationRunner.run(DefaultBuildOperationRunner.java:47)     at org.gradle.internal.operations.DefaultBuildOperationExecutor.run(DefaultBuildOperationExecutor.java:68)     at org.gradle.api.internal.tasks.execution.TaskExecution.executeAction(TaskExecution.java:227)     at org.gradle.api.internal.tasks.execution.TaskExecution.executeActions(TaskExecution.java:210)     at org.gradle.api.internal.tasks.execution.TaskExecution.executeWithPreviousOutputFiles(TaskExecution.java:193)     at org.gradle.api.internal.tasks.execution.TaskExecution.execute(TaskExecution.java:166)     at org.gradle.internal.execution.steps.ExecuteStep.executeInternal(ExecuteStep.java:93)     at org.gradle.internal.execution.steps.ExecuteStep.access$000(ExecuteStep.java:44)     at org.gradle.internal.execution.steps.ExecuteStep$1.call(ExecuteStep.java:57)     at org.gradle.internal.execution.steps.ExecuteStep$1.call(ExecuteStep.java:54)     at org.gradle.internal.operations.DefaultBuildOperationRunner$CallableBuildOperationWorker.execute(DefaultBuildOperationRunner.java:204)     at org.gradle.internal.operations.DefaultBuildOperationRunner$CallableBuildOperationWorker.execute(DefaultBuildOperationRunner.java:199)     at org.gradle.internal.operations.DefaultBuildOperationRunner$2.execute(DefaultBuildOperationRunner.java:66)     at org.gradle.internal.operations.DefaultBuildOperationRunner$2.execute(DefaultBuildOperationRunner.java:59)     at org.gradle.internal.operations.DefaultBuildOperationRunner.execute(DefaultBuildOperationRunner.java:157)     at org.gradle.internal.operations.DefaultBuildOperationRunner.execute(DefaultBuildOperationRunner.java:59)     at org.gradle.internal.operations.DefaultBuildOperationRunner.call(DefaultBuildOperationRunner.java:53)     at org.gradle.internal.operations.DefaultBuildOperationExecutor.call(DefaultBuildOperationExecutor.java:73)     at org.gradle.internal.execution.steps.ExecuteStep.execute(ExecuteStep.java:54)     at org.gradle.internal.execution.steps.ExecuteStep.execute(ExecuteStep.java:44)     at org.gradle.internal.execution.steps.RemovePreviousOutputsStep.execute(RemovePreviousOutputsStep.java:67)     at org.gradle.internal.execution.steps.RemovePreviousOutputsStep.execute(RemovePreviousOutputsStep.java:37)     at org.gradle.internal.execution.steps.CancelExecutionStep.execute(CancelExecutionStep.java:41)     at org.gradle.internal.execution.steps.TimeoutStep.executeWithoutTimeout(TimeoutStep.java:74)     at org.gradle.internal.execution.steps.TimeoutStep.execute(TimeoutStep.java:55)     at org.gradle.internal.execution.steps.CreateOutputsStep.execute(CreateOutputsStep.java:50)     at org.gradle.internal.execution.steps.CreateOutputsStep.execute(CreateOutputsStep.java:28)     at org.gradle.internal.execution.steps.CaptureStateAfterExecutionStep.executeDelegateBroadcastingChanges(CaptureStateAfterExecutionStep.java:100)     at org.gradle.internal.execution.steps.CaptureStateAfterExecutionStep.execute(CaptureStateAfterExecutionStep.java:72)     at org.gradle.internal.execution.steps.CaptureStateAfterExecutionStep.execute(CaptureStateAfterExecutionStep.java:50)     at org.gradle.internal.execution.steps.ResolveInputChangesStep.execute(ResolveInputChangesStep.java:40)     at org.gradle.internal.execution.steps.ResolveInputChangesStep.execute(ResolveInputChangesStep.java:29)     at org.gradle.internal.execution.steps.BuildCacheStep.executeWithoutCache(BuildCacheStep.java:166)     at org.gradle.internal.execution.steps.BuildCacheStep.lambda$execute$1(BuildCacheStep.java:70)     at org.gradle.internal.Either$Right.fold(Either.java:175)     at org.gradle.internal.execution.caching.CachingState.fold(CachingState.java:59)     at org.gradle.internal.execution.steps.BuildCacheStep.execute(BuildCacheStep.java:68)     at org.gradle.internal.execution.steps.BuildCacheStep.execute(BuildCacheStep.java:46)     at org.gradle.internal.execution.steps.StoreExecutionStateStep.execute(StoreExecutionStateStep.java:36)     at org.gradle.internal.execution.steps.StoreExecutionStateStep.execute(StoreExecutionStateStep.java:25)     at org.gradle.internal.execution.steps.RecordOutputsStep.execute(RecordOutputsStep.java:36)     at org.gradle.internal.execution.steps.RecordOutputsStep.execute(RecordOutputsStep.java:22)     at org.gradle.internal.execution.steps.SkipUpToDateStep.executeBecause(SkipUpToDateStep.java:91)     at org.gradle.internal.execution.steps.SkipUpToDateStep.lambda$execute$2(SkipUpToDateStep.java:55)     at java.base/java.util.Optional.orElseGet(Optional.java:364)     at org.gradle.internal.execution.steps.SkipUpToDateStep.execute(SkipUpToDateStep.java:55)     at org.gradle.internal.execution.steps.SkipUpToDateStep.execute(SkipUpToDateStep.java:37)     at org.gradle.internal.execution.steps.ResolveChangesStep.execute(ResolveChangesStep.java:65)     at org.gradle.internal.execution.steps.ResolveChangesStep.execute(ResolveChangesStep.java:36)     at org.gradle.internal.execution.steps.legacy.MarkSnapshottingInputsFinishedStep.execute(MarkSnapshottingInputsFinishedStep.java:37)     at org.gradle.internal.execution.steps.legacy.MarkSnapshottingInputsFinishedStep.execute(MarkSnapshottingInputsFinishedStep.java:27)     at org.gradle.internal.execution.steps.ResolveCachingStateStep.execute(ResolveCachingStateStep.java:76)     at org.gradle.internal.execution.steps.ResolveCachingStateStep.execute(ResolveCachingStateStep.java:37)     at org.gradle.internal.execution.steps.ValidateStep.execute(ValidateStep.java:94)     at org.gradle.internal.execution.steps.ValidateStep.execute(ValidateStep.java:49)     at org.gradle.internal.execution.steps.CaptureStateBeforeExecutionStep.execute(CaptureStateBeforeExecutionStep.java:71)     at org.gradle.internal.execution.steps.CaptureStateBeforeExecutionStep.execute(CaptureStateBeforeExecutionStep.java:45)     at org.gradle.internal.execution.steps.SkipEmptyWorkStep.executeWithNonEmptySources(SkipEmptyWorkStep.java:177)     at org.gradle.internal.execution.steps.SkipEmptyWorkStep.execute(SkipEmptyWorkStep.java:81)     at org.gradle.internal.execution.steps.SkipEmptyWorkStep.execute(SkipEmptyWorkStep.java:53)     at org.gradle.internal.execution.steps.RemoveUntrackedExecutionStateStep.execute(RemoveUntrackedExecutionStateStep.java:32)     at org.gradle.internal.execution.steps.RemoveUntrackedExecutionStateStep.execute(RemoveUntrackedExecutionStateStep.java:21)     at org.gradle.internal.execution.steps.legacy.MarkSnapshottingInputsStartedStep.execute(MarkSnapshottingInputsStartedStep.java:38)     at org.gradle.internal.execution.steps.LoadPreviousExecutionStateStep.execute(LoadPreviousExecutionStateStep.java:36)     at org.gradle.internal.execution.steps.LoadPreviousExecutionStateStep.execute(LoadPreviousExecutionStateStep.java:23)     at org.gradle.internal.execution.steps.CleanupStaleOutputsStep.execute(CleanupStaleOutputsStep.java:75)     at org.gradle.internal.execution.steps.CleanupStaleOutputsStep.execute(CleanupStaleOutputsStep.java:41)     at org.gradle.internal.execution.steps.AssignWorkspaceStep.lambda$execute$0(AssignWorkspaceStep.java:32)     at org.gradle.api.internal.tasks.execution.TaskExecution$4.withWorkspace(TaskExecution.java:287)     at org.gradle.internal.execution.steps.AssignWorkspaceStep.execute(AssignWorkspaceStep.java:30)     at org.gradle.internal.execution.steps.AssignWorkspaceStep.execute(AssignWorkspaceStep.java:21)     at org.gradle.internal.execution.steps.IdentityCacheStep.execute(IdentityCacheStep.java:37)     at org.gradle.internal.execution.steps.IdentityCacheStep.execute(IdentityCacheStep.java:27)     at org.gradle.internal.execution.steps.IdentifyStep.execute(IdentifyStep.java:42)     at org.gradle.internal.execution.steps.IdentifyStep.execute(IdentifyStep.java:31)     at org.gradle.internal.execution.impl.DefaultExecutionEngine$1.execute(DefaultExecutionEngine.java:64)     at org.gradle.api.internal.tasks.execution.ExecuteActionsTaskExecuter.executeIfValid(ExecuteActionsTaskExecuter.java:146)     at org.gradle.api.internal.tasks.execution.ExecuteActionsTaskExecuter.execute(ExecuteActionsTaskExecuter.java:135)     at org.gradle.api.internal.tasks.execution.FinalizePropertiesTaskExecuter.execute(FinalizePropertiesTaskExecuter.java:46)     at org.gradle.api.internal.tasks.execution.ResolveTaskExecutionModeExecuter.execute(ResolveTaskExecutionModeExecuter.java:51)     at org.gradle.api.internal.tasks.execution.SkipTaskWithNoActionsExecuter.execute(SkipTaskWithNoActionsExecuter.java:57)     at org.gradle.api.internal.tasks.execution.SkipOnlyIfTaskExecuter.execute(SkipOnlyIfTaskExecuter.java:74)     at org.gradle.api.internal.tasks.execution.CatchExceptionTaskExecuter.execute(CatchExceptionTaskExecuter.java:36)     at org.gradle.api.internal.tasks.execution.EventFiringTaskExecuter$1.executeTask(EventFiringTaskExecuter.java:77)     at org.gradle.api.internal.tasks.execution.EventFiringTaskExecuter$1.call(EventFiringTaskExecuter.java:55)     at org.gradle.api.internal.tasks.execution.EventFiringTaskExecuter$1.call(EventFiringTaskExecuter.java:52)     at org.gradle.internal.operations.DefaultBuildOperationRunner$CallableBuildOperationWorker.execute(DefaultBuildOperationRunner.java:204)     at org.gradle.internal.operations.DefaultBuildOperationRunner$CallableBuildOperationWorker.execute(DefaultBuildOperationRunner.java:199)     at org.gradle.internal.operations.DefaultBuildOperationRunner$2.execute(DefaultBuildOperationRunner.java:66)     at org.gradle.internal.operations.DefaultBuildOperationRunner$2.execute(DefaultBuildOperationRunner.java:59)     at org.gradle.internal.operations.DefaultBuildOperationRunner.execute(DefaultBuildOperationRunner.java:157)     at org.gradle.internal.operations.DefaultBuildOperationRunner.execute(DefaultBuildOperationRunner.java:59)     at org.gradle.internal.operations.DefaultBuildOperationRunner.call(DefaultBuildOperationRunner.java:53)     at org.gradle.internal.operations.DefaultBuildOperationExecutor.call(DefaultBuildOperationExecutor.java:73)     at org.gradle.api.internal.tasks.execution.EventFiringTaskExecuter.execute(EventFiringTaskExecuter.java:52)     at org.gradle.execution.plan.LocalTaskNodeExecutor.execute(LocalTaskNodeExecutor.java:42)     at org.gradle.execution.taskgraph.DefaultTaskExecutionGraph$InvokeNodeExecutorsAction.execute(DefaultTaskExecutionGraph.java:338)     at org.gradle.execution.taskgraph.DefaultTaskExecutionGraph$InvokeNodeExecutorsAction.execute(DefaultTaskExecutionGraph.java:325)     at org.gradle.execution.taskgraph.DefaultTaskExecutionGraph$BuildOperationAwareExecutionAction.execute(DefaultTaskExecutionGraph.java:318)     at org.gradle.execution.taskgraph.DefaultTaskExecutionGraph$BuildOperationAwareExecutionAction.execute(DefaultTaskExecutionGraph.java:304)     at org.gradle.execution.plan.DefaultPlanExecutor$ExecutorWorker.execute(DefaultPlanExecutor.java:463)     at org.gradle.execution.plan.DefaultPlanExecutor$ExecutorWorker.run(DefaultPlanExecutor.java:380)     at org.gradle.internal.concurrent.ExecutorPolicy$CatchAndRecordFailures.onExecute(ExecutorPolicy.java:64)     at org.gradle.internal.concurrent.ManagedExecutorImpl$1.run(ManagedExecutorImpl.java:49)     at java.base/java.util.concurrent.ThreadPoolExecutor.runWorker(ThreadPoolExecutor.java:1136)     at java.base/java.util.concurrent.ThreadPoolExecutor$Worker.run(ThreadPoolExecutor.java:635)     at java.base/java.lang.Thread.run(Thread.java:833) Caused by: com.android.builder.internal.aapt.v2.Aapt2Exception: Android resource linking failed E:\MyApplication\app\build\intermediates\packaged_manifests\debug\AndroidManifest.xml:73: error: resource xml/actions (aka com.example.myapplication:xml/actions) not found. error: failed processing manifest.     at com.android.builder.internal.aapt.v2.Aapt2Exception$Companion.create(Aapt2Exception.kt:45)     at com.android.builder.internal.aapt.v2.Aapt2Exception$Companion.create$default(Aapt2Exception.kt:33)     at com.android.builder.internal.aapt.v2.Aapt2DaemonImpl.doLink(Aapt2DaemonImpl.kt:188)     at com.android.builder.internal.aapt.v2.Aapt2Daemon.link(Aapt2Daemon.kt:124)     at com.android.builder.internal.aapt.v2.Aapt2DaemonManager$LeasedAaptDaemon.link(Aapt2DaemonManager.kt:176)     at com.android.builder.internal.aapt.v2.Aapt2DaemonManager$leasingAapt2Daemon$1.link(Aapt2DaemonManager.kt:199)     at com.android.build.gradle.internal.services.PartialInProcessResourceProcessor.link(PartialInProcessResourceProcessor.kt:51)     at com.android.build.gradle.internal.res.Aapt2ProcessResourcesRunnableKt.processResources(Aapt2ProcessResourcesRunnable.kt:74)     at com.android.build.gradle.internal.res.LinkApplicationAndroidResourcesTask$Companion.invokeAaptForSplit(LinkApplicationAndroidResourcesTask.kt:941)     at com.android.build.gradle.internal.res.LinkApplicationAndroidResourcesTask$Companion.access$invokeAaptForSplit(LinkApplicationAndroidResourcesTask.kt:796)     at com.android.build.gradle.internal.res.LinkApplicationAndroidResourcesTask$TaskAction.run(LinkApplicationAndroidResourcesTask.kt:431)     at com.android.build.gradle.internal.profile.ProfileAwareWorkAction.execute(ProfileAwareWorkAction.kt:74)     at org.gradle.workers.internal.DefaultWorkerServer.execute(DefaultWorkerServer.java:63)     at org.gradle.workers.internal.NoIsolationWorkerFactory$1$1.create(NoIsolationWorkerFactory.java:66)     at org.gradle.workers.internal.NoIsolationWorkerFactory$1$1.create(NoIsolationWorkerFactory.java:62)     at org.gradle.internal.classloader.ClassLoaderUtils.executeInClassloader(ClassLoaderUtils.java:100)     at org.gradle.workers.internal.NoIsolationWorkerFactory$1.lambda$execute$0(NoIsolationWorkerFactory.java:62)     at org.gradle.workers.internal.AbstractWorker$1.call(AbstractWorker.java:44)     at org.gradle.workers.internal.AbstractWorker$1.call(AbstractWorker.java:41)     at org.gradle.internal.operations.DefaultBuildOperationRunner$CallableBuildOperationWorker.execute(DefaultBuildOperationRunner.java:204)     at org.gradle.internal.operations.DefaultBuildOperationRunner$CallableBuildOperationWorker.execute(DefaultBuildOperationRunner.java:199)     at org.gradle.internal.operations.DefaultBuildOperationRunner$2.execute(DefaultBuildOperationRunner.java:66)     at org.gradle.internal.operations.DefaultBuildOperationRunner$2.execute(DefaultBuildOperationRunner.java:59)     at org.gradle.internal.operations.DefaultBuildOperationRunner.execute(DefaultBuildOperationRunner.java:157)     at org.gradle.internal.operations.DefaultBuildOperationRunner.execute(DefaultBuildOperationRunner.java:59)     at org.gradle.internal.operations.DefaultBuildOperationRunner.call(DefaultBuildOperationRunner.java:53)     at org.gradle.internal.operations.DefaultBuildOperationExecutor.call(DefaultBuildOperationExecutor.java:73)     at org.gradle.workers.internal.AbstractWorker.executeWrappedInBuildOperation(AbstractWorker.java:41)     at org.gradle.workers.internal.NoIsolationWorkerFactory$1.execute(NoIsolationWorkerFactory.java:59)     at org.gradle.workers.internal.DefaultWorkerExecutor.lambda$submitWork$0(DefaultWorkerExecutor.java:169)     at java.base/java.util.concurrent.FutureTask.run(FutureTask.java:264)     at org.gradle.internal.work.DefaultConditionalExecutionQueue$ExecutionRunner.runExecution(DefaultConditionalExecutionQueue.java:187)     at org.gradle.internal.work.DefaultConditionalExecutionQueue$ExecutionRunner.access$700(DefaultConditionalExecutionQueue.java:120)     at org.gradle.internal.work.DefaultConditionalExecutionQueue$ExecutionRunner$1.run(DefaultConditionalExecutionQueue.java:162)     at org.gradle.internal.Factories$1.create(Factories.java:31)     at org.gradle.internal.work.DefaultWorkerLeaseService.withLocks(DefaultWorkerLeaseService.java:249)     at org.gradle.internal.work.DefaultWorkerLeaseService.runAsWorkerThread(DefaultWorkerLeaseService.java:109)     at org.gradle.internal.work.DefaultWorkerLeaseService.runAsWorkerThread(DefaultWorkerLeaseService.java:114)     at org.gradle.internal.work.DefaultConditionalExecutionQueue$ExecutionRunner.runBatch(DefaultConditionalExecutionQueue.java:157)     at org.gradle.internal.work.DefaultConditionalExecutionQueue$ExecutionRunner.run(DefaultConditionalExecutionQueue.java:126)     at java.base/java.util.concurrent.Executors$RunnableAdapter.call(Executors.java:539)     at java.base/java.util.concurrent.FutureTask.run(FutureTask.java:264)     ... 5 more     Suppressed: java.lang.IllegalArgumentException: Unable to locate resourceFile (E:\MyApplication\app\build\intermediates\packaged_manifests\debug\AndroidManifest.xml) in source-sets.         at com.android.ide.common.resources.RelativeResourceUtils.getRelativeSourceSetPath(RelativeResourceUtils.kt:47)         at com.android.ide.common.blame.MergingLog.getPositionMap(MergingLog.java:229)         at com.android.ide.common.blame.MergingLog.find(MergingLog.java:213)         at com.android.build.gradle.internal.res.Aapt2ErrorUtils$rewriteLinkException$2.invoke(Aapt2ErrorUtils.kt:136)         at com.android.build.gradle.internal.res.Aapt2ErrorUtils$rewriteLinkException$2.invoke(Aapt2ErrorUtils.kt:133)         at com.android.build.gradle.internal.res.Aapt2ErrorUtils.rewritePositions(Aapt2ErrorUtils.kt:278)         at com.android.build.gradle.internal.res.Aapt2ErrorUtils.rewriteException(Aapt2ErrorUtils.kt:235)         at com.android.build.gradle.internal.res.Aapt2ErrorUtils.rewriteLinkException(Aapt2ErrorUtils.kt:133)         at com.android.build.gradle.internal.res.Aapt2ProcessResourcesRunnableKt.processResources(Aapt2ProcessResourcesRunnable.kt:76)         ... 39 more ============================================================================== * Get more help at https://help.gradle.org BUILD FAILED in 7s 26 actionable tasks: 7 executed, 19 up-to-date    
    • سلام من چند وقته آموزش اندروید استودیو رو شروع کردم ولی ارور زیاد میاره و کامل نمیتونم شروع کنم چطور میشه ارور هارو رفع کرد؟؟
    • سلام دوستان بعد از نصب اندروید در زمان بیلد با این مشکل برمیخورم. لطفا راهنمایی کنید چجوری این خطا برطرف میشه. با تشکر Plugin [id: 'com.android.application', version: '8.2.0', apply: false] was not found in any of the following sources:
    • خرید ممبر ایتا اگر شما هم دارای کانال ایتایی میباشید اما نمیدانید که برای رشد کانالتان باید چه کاری را انجام دهید میبایست ادامه این مطلب را به دقت مطلالعه نمایید. رشد کانال های ایتایی به موارد مختلفی بستگی دارد که در ادامه به بررسی آنها میپردازیم. 1 تولید محتوای بسیار قوی و منحصر بفرد اصلی ترین مورد در رشد کانال شما تولید یک محتوای قوی میباشد این محتوا باید کاملا تخصصی باشند و به قدری جذاب باشد تا کاربران آن را برای دیگران ارسال کنند . و این جذابیت محتوا سبب شود کاربران ماندگاری بالایی در کانال شما داشته باشند. سعی کنید محتوایی تولید کنید که تکراری نباشند و ودر توضیحات محتوا کامل درباره موضوع توضیح دهید تا کاربر به کلی مطالب را فرا بگیرد.  در تولید محتوا سعی کنید از ایموجی ها به صورت مناسب استفاده کنید و در هر پست بیشتر از 2 الی 4 ایموجی بیشتر استفاده نکنید. 2 ساخت بنر تبلیغاتی و تبلیغات هدفمند یکی دیگر از موارد مهم در رشد کانال تبلیغات هست اگر کانال شما کانال فروشگاهی هست و یک محصولی را در کانال خود ارئه میدهید. میبایست به صورت مداوم و همیشگی تبلیغ انجام دهید. در تبلیغات باید نکات مختلفی را رعایت کنید برای مثال یک بنر تبلیغاتی بسیار جذاب داشته باشید تا هر کاربری به سادگی از کنار ان نگذرد. سپس شما باید برای بنر جذاب خود بازدید از سایت های خرید بازدید ایتا خریداری نمایید. حتما توجه داشته باشید که از سایت های معتبر خرید نمایید.  3 خرید ممبر ایتا واقعی فقط در نهایت شما میتوانید برای رشد سریع تر کانال خود و اینکه بتوانید با کانال های دیگر تبادل کنید میبایست از پنل خرید ممبر ایتا ممبر واقعی خرید نمایید تا خیلی زود کاربران کانال خود را افزایش دهید. قبل از خرید ممبر میبایست از واقعی بودن آنها و کیفیت آنها آگاهی داشته باشید سپس اقدام به ثبت سفارش نمایید.
    • دیتابیس Realm یک سیستم مدیریت دیتابیس object-oriented است که برای توسعه دهندگان اپلیکیشن های موبایل و دسکتاپ که توسط تیم MongoDB طراحی شده است. این دیتابیس بر روی دستگاه کاربر اجرا می شود و به همین دلیل به آن دیتابیس امبد شده (embedded database) نیز گفته می شود. این سیستم مدیریت دیتابیس برای اندروید (Android)، iOS، و دیگر پلتفرم‌های موبایل قابل استفاده است. Realm به توسعه‌دهندگان اجازه می‌دهد داده‌های برنامه خود را به سرعت و با کارآیی بالا ذخیره و بازیابی کنند. نکته مهم که باید به آن توجه کنید این است که Realm یک نوع ORM نیست بلکه یک دیتابیسی است که از ابتدا با هدف استفاده در گوشی های هوشمند طراحی شده و برای اینکار بهینه سازی های مختلفی روی آن اعمال شده است. در فرآیند آموزش فلاتر یادگیری روش های مدیریت اطلاعات و ذخیره سازی حیاتی میباشد. برای شروع ابتدا با دستور زیر پکیج مورد نیاز را به پروژه فلاتر اضافه میکنیم. flutter pub add realm dart run realm install بعد از اضافه کردن پکیج های مورد نیاز کلاس مدل خود را میسازیم. در این مثال یک کلاس دانشجو در اختیار داریم که عملیات crud را روی انجام میدیم. یک فایل به نام student ایجاد میکنیم.   در این کلاس با @RealmModel() مشخص کرده ایم که از این کلاس برای ذخیره سازی اطلاعات استفاده خواهیم کرد. با کمک @PrimaryKey() نیز کلید اصلی پایگاه داده را مشخص میکنیم کدام فیلد باشد. در ابتدای این فایل عبارت part ‘student.g.dart’; را نیز باید قرار دهید, این تکه در ادامه کدهای مورد نیاز کلاس را ایجاد میکند. با اجرای دستور زیر در ترمینال کدهایی که برای ذخیره اطلاعات این کلاس در دیتابیس نیاز ساخته میشود. dart run realm generate برای اینکه کدهای بخش دیتابیس به شکل تمیز نوشته شوند یک کلاس جدا به نام StudentDatabase ایجاد میکنیم و تمام متدهای مورد نیاز برای انجام عملیات CRUD را در آن قرار میدهیم. کدهای کلاس به شکل زیر میباشد.   در این کلاس یک نمونه از کلاس Realm میسازیم که برای پارامتر ورودی از آبجکت config که مشخص کننده کلاس مدل است استفاده میکنیم. در ادامه چهار متد میسازیم که هر کدام عملیات CRUD را انجام میدهند. برای ذخیره سازی اطلاعات از دستور realm.write استفاده میکنیم, اگر مقدار update را برابر true قرار دهید در صورت وجود رکورد آن را آپدیت میکند. برای دریافت لیست کامل رکوردهای یک کلاس از دستور realm.objects().toList() میتوانید استفاده کنید.   منبع: دیتابیس Realm چیست؟ آموزش پیاده سازی در فلاتر  
×
×
  • اضافه کردن...