broken.heart

توسعه دهنده حرفه ای اندروید
  • تعداد ارسال ها

    203
  • تاریخ عضویت

  • آخرین بازدید

اعتبار در انجمن

7 Neutral

1 دنبال کننده

درباره broken.heart

  • درجه
    توسعه دهنده حرفه ای
  1. سلام دوستان یه مشکلی دارم یه چندروزیه درگیرشم نمیفهمم مشکل از کجاست من طبق آموزش ها عکس های اپلیکیشنم رو در سایز های استاندارد تغییر دادم و در پوشه های drawable drawable-hdpi drawable-mdpi drawable-xhdpi drawable-xxhdpi drawable-xxxhdpi با نام های مشابه و سایز های متفاوت (که همشو شناسایی کرده و توی نام گذاری و پوشه ها میدونم مشکلی نیست) قرار دادم و حتی برای اطمینان بیشتر لایه هام رو در سایز های مختلف در پوشه های مناسب به این شکل قرار دادم layout-larg layout-normal layout-smal layout-xlarg اما در زمان اجرا عکس مناسب رو طبق سایز گوشی انتخاب نمیکنه ینی اگر تبلت باشه از عکس سایز کوچک استفاده میکنه و اگرم گوشی سایز کوچیک باشه از همون عکس سایز کوچیک استفاده میکنه در هر حال براش فرقی نداره درصورتی که بایت اتومات عکس مناسب رو از پوشه مناسب براس سایز مناسب انتخاب کنه برای همه اوکی هست به همین شکل اما برای من اوکی نمیشه چندروزه درگیرشم نمیفهمم مشکل چیه
  2. کسی نمیدونه مشکل چیه؟
  3. فقط میدونم که اروری که میده میگه این فایل http://'uk.co.chrisjenx:calligraphy:2.3.0'uk.co.chrisjenx:calligraphy:2.3.0@aar. رو پیدا نمیکنم و میدونم که فایلی با پسوند aar در سایت https://github.com/chrisjenx/Calligraphy قرار داره اما نمیدونم این فایل رو چطور باید به پروژه اضافه کنم؟
  4. در صورتی که compile 'uk.co.chrisjenx:calligraphy:2.3.0' رو به implementaion 'uk.co.chrisjenx:calligraphy:2.3.0' تغییر میدم پروژه بیلد میشه اما در زمان استفاده از کد و اجرا برنامه با این ارور مواجه میشم 11:02:39 AM: Executing task 'DownloadSources'... Executing tasks: [DownloadSources] > Configure project :app WARNING: Configuration 'compile' is obsolete and has been replaced with 'implementation' and 'api'. It will be removed at the end of 2018. For more information see: http://d.android.com/r/tools/update-dependency-configurations.html > Task :app:DownloadSources FAILED FAILURE: Build failed with an exception. * Where: Initialization script 'C:\Users\A\AppData\Local\Temp\ijmiscinit2.gradle' line: 19 * What went wrong: Execution failed for task ':app:DownloadSources'. > Could not resolve all files for configuration ':app:downloadSources_dfc26481-738c-40eb-b476-a513f60d874b'. > Could not find uk.co.chrisjenx:calligraphy:2.3.0@aar. Required by: project :app * Try: Run with --stacktrace option to get the stack trace. Run with --info or --debug option to get more log output. Run with --scan to get full insights. * Get more help at https://help.gradle.org Deprecated Gradle features were used in this build, making it incompatible with Gradle 6.0. Use '--warning-mode all' to show the individual deprecation warnings. See https://docs.gradle.org/5.1.1/userguide/command_line_interface.html#sec:command_line_warnings BUILD FAILED in 3s 1 actionable task: 1 executed 11:02:43 AM: Task execution finished 'DownloadSources'.
  5. سلام دوستان من کتاب خانه calligraphy رو برای تغییر فونت برنامم میخوام استفاده کنم اما کد رو در گریدل که وارد میکنم ارور میگیره و بیلد نمیشه این کد فایل گریدلم هست apply plugin: 'com.android.application' android { compileSdkVersion 28 defaultConfig { applicationId "com.example.xxx" minSdkVersion 16 targetSdkVersion 28 versionCode 1 versionName "1.0" testInstrumentationRunner "android.support.test.runner.AndroidJUnitRunner" } buildTypes { release { minifyEnabled false proguardFiles getDefaultProguardFile('proguard-android-optimize.txt'), 'proguard-rules.pro' } } } dependencies { implementation fileTree(dir: 'libs', include: ['*.jar']) implementation 'com.android.support:appcompat-v7:28.0.0' implementation 'com.android.support.constraint:constraint-layout:1.1.3' testImplementation 'junit:junit:4.12' androidTestImplementation 'com.android.support.test:runner:1.0.2' androidTestImplementation 'com.android.support.test.espresso:espresso-core:3.0.2' //calligraphy font compile 'uk.co.chrisjenx:calligraphy:2.3.0' } و این هم اروری که میده WARNING: Configuration 'compile' is obsolete and has been replaced with 'implementation' and 'api'. It will be removed at the end of 2018. For more information see: http://d.android.com/r/tools/update-dependency-configurations.html Affected Modules: app
  6. سلام دوستان من یه imag view وارد صفحه کردم وقتی براش عکس انتخاب میکنم نرمافزار اجرا نمیشه و این ارور رو میده E/AndroidRuntime: FATAL EXCEPTION: main Process: com.example.myapplication, PID: 3644 java.lang.RuntimeException: Unable to start activity ComponentInfo{com.example.myapplication/com.example.myapplication.MainActivity}: android.view.InflateException: Binary XML file line #28: Error inflating class ImageView at android.app.ActivityThread.performLaunchActivity(ActivityThread.java:2327) at android.app.ActivityThread.handleLaunchActivity(ActivityThread.java:2392) at android.app.ActivityThread.access$800(ActivityThread.java:153) at android.app.ActivityThread$H.handleMessage(ActivityThread.java:1305) at android.os.Handler.dispatchMessage(Handler.java:102) at android.os.Looper.loop(Looper.java:135) at android.app.ActivityThread.main(ActivityThread.java:5293) at java.lang.reflect.Method.invoke(Native Method) at java.lang.reflect.Method.invoke(Method.java:372) at com.android.internal.os.ZygoteInit$MethodAndArgsCaller.run(ZygoteInit.java:903) at com.android.internal.os.ZygoteInit.main(ZygoteInit.java:698) Caused by: android.view.InflateException: Binary XML file line #28: Error inflating class ImageView at android.view.LayoutInflater.createViewFromTag(LayoutInflater.java:763) at android.view.LayoutInflater.rInflate(LayoutInflater.java:806) at android.view.LayoutInflater.rInflate(LayoutInflater.java:809) at android.view.LayoutInflater.rInflate(LayoutInflater.java:809) at android.view.LayoutInflater.inflate(LayoutInflater.java:504) at android.view.LayoutInflater.inflate(LayoutInflater.java:414) at android.view.LayoutInflater.inflate(LayoutInflater.java:365) at android.support.v7.app.AppCompatDelegateImpl.setContentView(AppCompatDelegateImpl.java:469) at android.support.v7.app.AppCompatActivity.setContentView(AppCompatActivity.java:140) at com.example.myapplication.MainActivity.onCreate(MainActivity.java:25) at android.app.Activity.performCreate(Activity.java:5990) at android.app.Instrumentation.callActivityOnCreate(Instrumentation.java:1106) at android.app.ActivityThread.performLaunchActivity(ActivityThread.java:2280) at android.app.ActivityThread.handleLaunchActivity(ActivityThread.java:2392) at android.app.ActivityThread.access$800(ActivityThread.java:153) at android.app.ActivityThread$H.handleMessage(ActivityThread.java:1305) at android.os.Handler.dispatchMessage(Handler.java:102) at android.os.Looper.loop(Looper.java:135) at android.app.ActivityThread.main(ActivityThread.java:5293) at java.lang.reflect.Method.invoke(Native Method) at java.lang.reflect.Method.invoke(Method.java:372) at com.android.internal.os.ZygoteInit$MethodAndArgsCaller.run(ZygoteInit.java:903) at com.android.internal.os.ZygoteInit.main(ZygoteInit.java:698) Caused by: android.content.res.Resources$NotFoundException: Resource "com.example.myapplication:drawable/logo" (7f060059) is not a Drawable (color or path): TypedValue{t=0x1/d=0x7f060059 a=-1 r=0x7f060059} at android.content.res.Resources.loadDrawableForCookie(Resources.java:2441) at android.content.res.Resources.loadDrawable(Resources.java:2381) at android.content.res.TypedArray.getDrawable(TypedArray.java:749) at android.view.View.<init>(View.java:3737) at android.widget.ImageView.<init>(ImageView.java:139) at android.widget.ImageView.<init>(ImageView.java:135) at android.support.v7.widget.AppCompatImageView.<init>(AppCompatImageView.java:72) at android.support.v7.widget.AppCompatImageView.<init>(AppCompatImageView.java:68) at android.support.v7.app.AppCompatViewInflater.createImageView(AppCompatViewInflater.java:182) at android.support.v7.app.AppCompatViewInflater.createView(AppCompatViewInflater.java:106) at android.support.v7.app.AppCompatDelegateImpl.createView(AppCompatDelegateImpl.java:1266) at android.support.v7.app.AppCompatDelegateImpl.onCreateView(AppCompatDelegateImpl.java:1316) at android.view.LayoutInflater.createViewFromTag(LayoutInflater.java:725) at android.view.LayoutInflater.rInflate(LayoutInflater.java:806) at android.view.LayoutInflater.rInflate(LayoutInflater.java:809) at android.view.LayoutInflater.rInflate(LayoutInflater.java:809) at android.view.LayoutInflater.inflate(LayoutInflater.java:504) at android.view.LayoutInflater.inflate(LayoutInflater.java:414) at android.view.LayoutInflater.inflate(LayoutInflater.java:365) at android.support.v7.app.AppCompatDelegateImpl.setContentView(AppCompatDelegateImpl.java:469) at android.support.v7.app.AppCompatActivity.setContentView(AppCompatActivity.java:140) at com.example.myapplication.MainActivity.onCreate(MainActivity.java:25) at android.app.Activity.performCreate(Activity.java:5990) at android.app.Instrumentation.callActivityOnCreate(Instrumentation.java:1106) at android.app.ActivityThread.performLaunchActivity(ActivityThread.java:2280) at android.app.ActivityThread.handleLaunchActivity(ActivityThread.java:2392) at android.app.ActivityThread.access$800(ActivityThread.java:153) at android.app.ActivityThread$H.handleMessage(ActivityThread.java:1305) at android.os.Handler.dispatchMessage(Handler.java:102) at android.os.Looper.loop(Looper.java:135) at android.app.ActivityThread.main(ActivityThread.java:5293) at java.lang.reflect.Method.invoke(Native Method) at java.lang.reflect.Method.invoke(Method.java:372) at com.android.internal.os.ZygoteInit$MethodAndArgsCaller.run(ZygoteInit.java:903) at com.android.internal.os.ZygoteInit.main(ZygoteInit.java:698) کسی میدونه مشکل چیه؟
  7. کسی میتونه راهنمایی کنه؟
  8. چجوری باید بزارمش روی حالت افلاین که این مشکل نباشه دیگه میدونم که تو تنظیمات گریدل میشه تنظیمش کرد به حالت افلاین اما نمیدونم چه فایلی رئ باید دانلود کنم و توی چه ادرسی قرار بدم تا گریدل رو افلاین بیلد کنه ممنون میشم راهنماییم کنید
  9. لینک یه فایلی رو میده با پسوند .jar دانلود میشه اما این فایل رو توی هر ادرسی میزارم فایده نداره
  10. سلام دوستان خسته نباشید من یه مشکلی دارم اندرورد استدیو جدیدش رو دانلود کردم اما تو لود گریدل مشکل داره سرچ زدم تمام موارد رو اوکی کردم اما بازم مشکل داره ارور اینه Could not HEAD 'https://repo.maven.apache.org/maven2/com/android/tools/build/gradle/3.3.2/gradle-3.3.2.pom'. Received status code 503 from server: Service Unavailable Enable Gradle 'offline mode' and sync project و فایل build.gradle هم کداش اینه // Top-level build file where you can add configuration options common to all sub-projects/modules. buildscript { repositories { mavenCentral() } dependencies { classpath 'com.android.tools.build:gradle:3.3.2' // NOTE: Do not place your application dependencies here; they belong // in the individual module build.gradle files } } allprojects { repositories { mavenCentral() } } task clean(type: Delete) { delete rootProject.buildDir } مشکل کجاست؟ ممنون میشم راهنماییم کنید خیلی درگیرشم با شیلتر فکنم باز میکنم فایده نداره